{"text_format":"1","workbook":"xlsx","n_sheets":10,"sheets":["Contents","Front Page","Other Provider Data","Other Provider List","Reference Tables","Multiplier Review","Payments Review","Service Review","Payers","System Data"],"not_rendered":{"charts":0,"images":0,"macros":1,"external_links":0,"defined_names":18,"comments":0,"pivot_tables":0},"unopened":[],"bounds":{"document_bytes":16777216,"sheet_cells":100000,"rows_first":2000,"rows_last":500,"rows_between":2000,"halvings":0,"cell_chars":16384,"cell_head_chars":4096},"cells_cut":0,"cells_raw":0,"read":"whole","date_system":"1900"}

{"sheet":"Contents","index":0,"n_rows":21,"n_cols":3,"rows_kept":21,"cut":false,"hidden":false,"merged":[[0,0,0,2],[1,0,1,2],[14,1,14,2]]}
["Payer Reporting of Relative Price"]
["Table of Contents"]
[]
[null,"Tab Name","Details"]
[null,"Front Page","Summary overview of the Workbook"]
[null,"Other Provider Data","Location for data entry by submitters"]
[null,"Other Provider List","Reference table with Provider Groups and accompanying OrgIDs"]
[null,"Reference Tables","Lookup codes for data entry are provided here"]
[null,"Payments Review","Summary of payments by Physician Group"]
[null,"Multiplier Review","Summary of multipliers by Service Group"]
[null,"Service Review","Summary of Service Groups reported by Provider Group"]
[]
[]
[]
[null,"Workbook Color Key"]
[null,null,"User Data Entry tab"]
[null,null,"Auto-populated Field"]
[null,null,"Reference Materials"]
[null,null,"Summary of Entered Data"]
[null,null,"Identified Error"]
[null,null,"Attention Required"]

{"sheet":"Front Page","index":1,"n_rows":50,"n_cols":9,"rows_kept":50,"cut":false,"hidden":false,"merged":[[33,5,33,6],[33,7,33,8],[32,1,32,8],[0,0,0,1],[1,0,1,1],[8,1,8,2],[22,1,22,2],[17,1,17,2]]}
["Payer Reporting of Relative Price"]
["A. File Overview and Payer Verification"]
[]
[]
[null,"Required Fields *"]
["Contact Name:  *"]
["Contact Email:  *",null,{"$f":"IF(ISBLANK(B7),\"\",IF(AND(RIGHT(B7,3)<>\"org\",RIGHT(B7,3)<>\"com\"),\"ERROR: Please enter a valid email address\",\"\"))","v":""}]
[]
[null,"Table A.1: File Overview"]
[null,"Payer OrgID *",{"$f":"IF(ISBLANK(iPayer),\"\",INDEX(PayersList,iPayer,1))","v":0}]
[null,"Payer Name *",{"$f":"IF(ISBLANK(iPayer),\"\",INDEX(PayersList,iPayer,2))","v":"Select Payer:"}]
[null,"Submission Year *"]
[null,"Data Year *"]
[]
[]
[]
[]
[null,"Table A.2: Data Checks"]
[null,"Other Provider Data Tab",{"$f":"IF(AND('Other Provider Data'!J3=\"\",'Other Provider Data'!K3=\"\",'Other Provider Data'!L3=\"\",'Other Provider Data'!M3=\"\",'Other Provider Data'!N3=\"\",'Other Provider Data'!O3=\"\",'Other Provider Data'!P3=\"\",'Other Provider Data'!Q3=\"\"), \"Please run Data Review prior to submission\", IF((COUNTIF('Other Provider Data'!J:Q,\"*\"&\"ERROR\"&\"*\")>0)=TRUE, \"Errors identified on Other Provider Data Tab, please correct\", \"All entered data is valid\"))","v":"Please run Data Review prior to submission"}]
[null,"Service Review Tab",{"$f":"IF(AND('Other Provider Data'!J3=\"\",'Other Provider Data'!K3=\"\",'Other Provider Data'!L3=\"\",'Other Provider Data'!M3=\"\",'Other Provider Data'!N3=\"\",'Other Provider Data'!O3=\"\",'Other Provider Data'!P3=\"\",'Other Provider Data'!Q3=\"\"), \"Please run Data Review prior to submission\", IF((COUNTIF('Service Review'!G:G,\"*\"&\"ERROR\"&\"*\")>0)=TRUE, \"Errors identified on Service Review, please correct\", \"All entered data is valid\"))","v":"Please run Data Review prior to submission"}]
[]
[]
[null,"Table A.3: Data Review Certifications"]
[null,"Data Tab","Acknowledgement"]
[null,"I acknowledge that I have reviewed the Other Provider Data tab  *"]
[null,"I acknowledge that I have reviewed the Payments Review tab  *"]
[null,"I acknowledge that I have reviewed the Multiplier Review tab  *"]
[null,"I acknowledge that I have reviewed the Service Review tab *"]
[null,"RP Comments"]
[null,"Additional Comments"]
[]
[]
[null,"Table A.4: In-Network Providers"]
[null,null,null,null,null,"Providers",null,"Percent of Payments"]
[null,"Insurance Category","Product Type","Total Payments","Number of Provider Groups","In Network *","Out of Network *","In Network *","Out of Network *"]
[null,null,null,null,{"$f":"IF(B36=\"\",\"\",SUM(--(FREQUENCY(IF(('Other Provider Data'!$N:$N= 'Front Page'!B36)*('Other Provider Data'!$O:$O = 'Front Page'!C36),'Other Provider Data'!A$1:A$2),'Other Provider Data'!A$1:A$2)>0)))","v":""}]
[null,null,null,null,{"$f":"IF(B37=\"\",\"\",SUM(--(FREQUENCY(IF(('Other Provider Data'!$N:$N= 'Front Page'!B37)*('Other Provider Data'!$O:$O = 'Front Page'!C37),'Other Provider Data'!A$1:A$2),'Other Provider Data'!A$1:A$2)>0)))","v":""}]
[null,null,null,null,{"$f":"IF(B38=\"\",\"\",SUM(--(FREQUENCY(IF(('Other Provider Data'!$N:$N= 'Front Page'!B38)*('Other Provider Data'!$O:$O = 'Front Page'!C38),'Other Provider Data'!A$1:A$2),'Other Provider Data'!A$1:A$2)>0)))","v":""}]
[null,null,null,null,{"$f":"IF(B39=\"\",\"\",SUM(--(FREQUENCY(IF(('Other Provider Data'!$N:$N= 'Front Page'!B39)*('Other Provider Data'!$O:$O = 'Front Page'!C39),'Other Provider Data'!A$1:A$2),'Other Provider Data'!A$1:A$2)>0)))","v":""}]
[null,null,null,null,{"$f":"IF(B40=\"\",\"\",SUM(--(FREQUENCY(IF(('Other Provider Data'!$N:$N= 'Front Page'!B40)*('Other Provider Data'!$O:$O = 'Front Page'!C40),'Other Provider Data'!A$1:A$2),'Other Provider Data'!A$1:A$2)>0)))","v":""}]
[null,null,null,null,{"$f":"IF(B41=\"\",\"\",SUM(--(FREQUENCY(IF(('Other Provider Data'!$N:$N= 'Front Page'!B41)*('Other Provider Data'!$O:$O = 'Front Page'!C41),'Other Provider Data'!A$1:A$2),'Other Provider Data'!A$1:A$2)>0)))","v":""}]
[null,null,null,null,{"$f":"IF(B42=\"\",\"\",SUM(--(FREQUENCY(IF(('Other Provider Data'!$N:$N= 'Front Page'!B42)*('Other Provider Data'!$O:$O = 'Front Page'!C42),'Other Provider Data'!A$1:A$2),'Other Provider Data'!A$1:A$2)>0)))","v":""}]
[null,null,null,null,{"$f":"IF(B43=\"\",\"\",SUM(--(FREQUENCY(IF(('Other Provider Data'!$N:$N= 'Front Page'!B43)*('Other Provider Data'!$O:$O = 'Front Page'!C43),'Other Provider Data'!A$1:A$2),'Other Provider Data'!A$1:A$2)>0)))","v":""}]
[null,null,null,null,{"$f":"IF(B44=\"\",\"\",SUM(--(FREQUENCY(IF(('Other Provider Data'!$N:$N= 'Front Page'!B44)*('Other Provider Data'!$O:$O = 'Front Page'!C44),'Other Provider Data'!A$1:A$2),'Other Provider Data'!A$1:A$2)>0)))","v":""}]
[null,null,null,null,{"$f":"IF(B45=\"\",\"\",SUM(--(FREQUENCY(IF(('Other Provider Data'!$N:$N= 'Front Page'!B45)*('Other Provider Data'!$O:$O = 'Front Page'!C45),'Other Provider Data'!A$1:A$2),'Other Provider Data'!A$1:A$2)>0)))","v":""}]
[null,null,null,null,{"$f":"IF(B46=\"\",\"\",SUM(--(FREQUENCY(IF(('Other Provider Data'!$N:$N= 'Front Page'!B46)*('Other Provider Data'!$O:$O = 'Front Page'!C46),'Other Provider Data'!A$1:A$2),'Other Provider Data'!A$1:A$2)>0)))","v":""}]
[null,null,null,null,{"$f":"IF(B47=\"\",\"\",SUM(--(FREQUENCY(IF(('Other Provider Data'!$N:$N= 'Front Page'!B47)*('Other Provider Data'!$O:$O = 'Front Page'!C47),'Other Provider Data'!A$1:A$2),'Other Provider Data'!A$1:A$2)>0)))","v":""}]
[null,null,null,null,{"$f":"IF(B48=\"\",\"\",SUM(--(FREQUENCY(IF(('Other Provider Data'!$N:$N= 'Front Page'!B48)*('Other Provider Data'!$O:$O = 'Front Page'!C48),'Other Provider Data'!A$1:A$2),'Other Provider Data'!A$1:A$2)>0)))","v":""}]
[null,null,null,null,{"$f":"IF(B49=\"\",\"\",SUM(--(FREQUENCY(IF(('Other Provider Data'!$N:$N= 'Front Page'!B49)*('Other Provider Data'!$O:$O = 'Front Page'!C49),'Other Provider Data'!A$1:A$2),'Other Provider Data'!A$1:A$2)>0)))","v":""}]
[null,null,null,null,{"$f":"IF(B50=\"\",\"\",SUM(--(FREQUENCY(IF(('Other Provider Data'!$N:$N= 'Front Page'!B50)*('Other Provider Data'!$O:$O = 'Front Page'!C50),'Other Provider Data'!A$1:A$2),'Other Provider Data'!A$1:A$2)>0)))","v":""}]

{"sheet":"Other Provider Data","index":2,"n_rows":1,"n_cols":17,"rows_kept":1,"cut":false,"hidden":false,"merged":[]}
["ProviderGroupOrgID","LocalPracticeOrgID","InsuranceCategoryCode","ProductTypeCode","Service","MultiplierIndicator","Multiplier","ClaimsPayments","NonClaimsPayments","TotalPayments","ProviderGroup","LocalPracticeGroup","OtherProviderType","InsuranceCategory","ProductType","MultiplierType","DataChecks"]

{"sheet":"Other Provider List","index":3,"n_rows":1071,"n_cols":8,"rows_kept":1071,"cut":false,"hidden":false,"merged":[]}
["OrgID","Provider","Organization Type",null,null,null,"Unique","All"]
[9822,"Advanced Eye Surgery Center","Ambulatory Surgical Centers",null,null,null,{"$f":"COUNT(_xlfn.UNIQUE(A:A))","v":1070},{"$f":"COUNT(A:A)","v":1070}]
[999901,"Ambulatory Surgical Centers","Ambulatory Surgical Centers"]
[286,"ARC Worcester Center ","Ambulatory Surgical Centers"]
[20013,"Azzouni & Babameto Oral Surgeons","Ambulatory Surgical Centers"]
[268,"Boston Center for Ambulatory Surgery","Ambulatory Surgical Centers"]
[7243,"Boston Endoscopy Center","Ambulatory Surgical Centers"]
[269,"Boston Eye Surgery and Laser Center - Boston","Ambulatory Surgical Centers"]
[12054,"Boston Eye Surgery and Laser Center - Waltham","Ambulatory Surgical Centers"]
[11895,"Boston IVF","Ambulatory Surgical Centers"]
[8086,"Boston Outpatient Surgical Suites","Ambulatory Surgical Centers"]
[10722,"Boston Surgery Center","Ambulatory Surgical Centers"]
[285,"Boston University Eye Associates Surgery and Laser Center ","Ambulatory Surgical Centers"]
[276,"Candescent Eye Health Surigical Center (Greater New Bedford Surgicenter)","Ambulatory Surgical Centers"]
[8884,"Cape and Islands Endoscopy Center","Ambulatory Surgical Centers"]
[7236,"Cape Cod Ambulatory Surgical Center","Ambulatory Surgical Centers"]
[7235,"Cape Cod Eye Surgery and Laser Center","Ambulatory Surgical Centers"]
[271,"Cataract and Laser Center","Ambulatory Surgical Centers"]
[7238,"Cataract and Laser Center Associates - Adams","Ambulatory Surgical Centers"]
[7237,"Cataract and Laser Center Central ","Ambulatory Surgical Centers"]
[7775,"Cataract and Laser Center of the North Shore","Ambulatory Surgical Centers"]
[8698,"Central Massachusetts Ambulatory Endoscopy Center","Ambulatory Surgical Centers"]
[10692,"Charles River Endoscopy","Ambulatory Surgical Centers"]
[272,"Commonwealth Endoscopy Center","Ambulatory Surgical Centers"]
[12415,"D'Ambrosio Eye Care","Ambulatory Surgical Centers"]
[9593,"DHA Endoscopy","Ambulatory Surgical Centers"]
[8713,"East Bay Surgery Center","Ambulatory Surgical Centers"]
[11243,"East Pond Enterprises","Ambulatory Surgical Centers"]
[10721,"Eastern Massachusetts Surgery Center","Ambulatory Surgical Centers"]
[274,"Eye Institute of the Merrimack Valley","Ambulatory Surgical Centers"]
[10891,"Greater Springfield Surgery Center  ","Ambulatory Surgical Centers"]
[273,"Hyannis Ear Nose and Throat Associates","Ambulatory Surgical Centers"]
[11232,"Hyde Park Pain Management","Ambulatory Surgical Centers"]
[10431,"Mass General / North Shore Center for Outpatient Care","Ambulatory Surgical Centers"]
[11540,"Merrimack Valley Endoscopy Center","Ambulatory Surgical Centers"]
[10729,"MGH Radiation Oncology at Newton-Wellesley Hospital","Ambulatory Surgical Centers"]
[8978,"Middlesex Digestive Health and Endoscopy Center","Ambulatory Surgical Centers"]
[20523,"NATICK SURGERY CENTER LLC DBA N","Ambulatory Surgical Centers"]
[20598,"Natick Surgery Center, LLC","Ambulatory Surgical Centers"]
[9673,"New England Ambulatory SurgiCenter - Cambridge","Ambulatory Surgical Centers"]
[278,"New England Eye Surgical Center - Beverly","Ambulatory Surgical Centers"]
[8717,"New England Pain Care","Ambulatory Surgical Centers"]
[12014,"New England Surgery Center","Ambulatory Surgical Centers"]
[9499,"New England Surgical Center for Outpatient Endoscopy","Ambulatory Surgical Centers"]
[20014,"Newburyport Oral Surgery, Inc","Ambulatory Surgical Centers"]
[7245,"North Shore Cataract and Laser Center","Ambulatory Surgical Centers"]
[9379,"North Suburban Orthopaedics Associates","Ambulatory Surgical Centers"]
[7234,"Northeast Ambulatory Center","Ambulatory Surgical Centers"]
[9594,"Northeast Endoscopy Center","Ambulatory Surgical Centers"]
[8695,"Orthopaedic Surgical Center of the North Shore","Ambulatory Surgical Centers"]
[12657,"Pilgrim Independent Physician Association (PIPA)","Ambulatory Surgical Centers"]
[8082,"Pioneer Valley SurgiCenter","Ambulatory Surgical Centers"]
[20210,"Plymouth Ears Nose and Throat","Ambulatory Surgical Centers"]
[280,"Plymouth Laser and Surgical Center","Ambulatory Surgical Centers"]
[9776,"PRIMA CARE PC","Ambulatory Surgical Centers"]
[281,"Same Day SurgiCare of New England","Ambulatory Surgical Centers"]
[282,"South Shore Endoscopy Center","Ambulatory Surgical Centers"]
[10718,"Spine Institute of New England","Ambulatory Surgical Centers"]
[12000,"Surgical Eye Experts of New England","Ambulatory Surgical Centers"]
[270,"The Cataract and Laser Center West","Ambulatory Surgical Centers"]
[10726,"The Cataract Surgery Center of Milford","Ambulatory Surgical Centers"]
[20023,"The Endoscopy Center - Reliant Medical Group","Ambulatory Surgical Centers"]
[19861,"The Surgery Center of Shrewbury","Ambulatory Surgical Centers"]
[12990,"Tufts University School of Dental Medicine Clinic","Ambulatory Surgical Centers"]
[4474,"UMass Memorial EMS","Ambulatory Surgical Centers"]
[19862,"UMS Management Services LLC","Ambulatory Surgical Centers"]
[8024,"Valley Medical Group","Ambulatory Surgical Centers"]
[11864,"West Bridgewater MA Endoscopy Asc","Ambulatory Surgical Centers"]
[8987,"West Suburban Eye Surgery Center","Ambulatory Surgical Centers"]
[8688,"Weymouth Endoscopy","Ambulatory Surgical Centers"]
[11581,"Worcester Surgical Center","Ambulatory Surgical Centers"]
[8392,"Associates for Human Services, Inc","Community Health Centers"]
[3258,"Baystate Brightwood Health Center","Community Health Centers"]
[11379,"Baystate High Street Health Center - Adult Medicine","Community Health Centers"]
[7835,"Baystate Mason Square Neighborhood Health Center","Community Health Centers"]
[12954,"BIOMEDICAL APPLICATIONS OF MASSACHUSETTS, INC.","Community Health Centers"]
[15,"Boston Health Care for the Homeless Program","Community Health Centers"]
[11,"Bowdoin Street Health Center","Community Health Centers"]
[26,"Brockton Neighborhood Health Center","Community Health Centers"]
[23,"Brookside Community Health Center","Community Health Centers"]
[34,"Cambridge Health Alliance - Cambridge Family Health","Community Health Centers"]
[29,"Cambridge Health Alliance (CHA) - Cambridge Family Health North","Community Health Centers"]
[3280,"Cambridge Public Health Commission","Community Health Centers"]
[125,"Caring Health Center","Community Health Centers"]
[80,"Charles River Community Health","Community Health Centers"]
[4155,"CHP Health Center","Community Health Centers"]
[17,"Codman Square Health Center","Community Health Centers"]
[6798,"Community Health Center of Cape Cod","Community Health Centers"]
[3104,"Community Health Center of Franklin County","Community Health Centers"]
[999902,"Community Health Centers","Community Health Centers"]
[4051,"Community Health Connections - Fitchburg","Community Health Centers"]
[9416,"Community Health Programs, Inc.","Community Health Centers"]
[12285,"DaVita Dialysis - Northeast Cambridge","Community Health Centers"]
[12288,"DaVita Dialysis - Wellington Circle","Community Health Centers"]
[12957,"DaVita Salem Northeast Dialysis","Community Health Centers"]
[7721,"Dialysis Clinic, Inc.","Community Health Centers"]
[55,"Dimock Community Health Center","Community Health Centers"]
[18,"Dorchester House Multi-Service Center","Community Health Centers"]
[19853,"DotHouse Health","Community Health Centers"]
[1472,"Duffy Health Center","Community Health Centers"]
[19,"East Boston Neighborhood Health Center","Community Health Centers"]
[63,"Edward M. Kennedy Community Health Center","Community Health Centers"]
[11401,"Everett Family Health Center","Community Health Centers"]
[58,"Family Health Center of Worcester","Community Health Centers"]
[60,"Fenway Community Health Center","Community Health Centers"]
[19940,"Fresenius Kidney Care Hampshire County","Community Health Centers"]
[12281,"Fresenius Medical Care Boston Carney","Community Health Centers"]
[61,"Geiger Gibson Community Health Center","Community Health Centers"]
[64,"Greater Lawrence Family Health Center","Community Health Centers"]
[12207,"Greater Lawrence Family Health Center - Lawrence General Hospital ","Community Health Centers"]
[10218,"Greater Lawrence Family Health Center - Park Street","Community Health Centers"]
[65,"Greater New Bedford Community Health Center","Community Health Centers"]
[20,"Greater Roslindale Medical and Dental Center","Community Health Centers"]
[12340,"Harbor Community Health Center - Plymouth","Community Health Centers"]
[4461,"Harbor Health Services","Community Health Centers"]
[69,"Harvard Street Neighborhood Health Center","Community Health Centers"]
[20247,"Health Imperatives,Inc","Community Health Centers"]
[72,"HealthFirst Family Care Center","Community Health Centers"]
[74,"Hilltown Community Health Centers","Community Health Centers"]
[76,"Holyoke Health Center","Community Health Centers"]
{"$rows_left_out":952}
{"sheet":"Reference Tables","index":4,"n_rows":35,"n_cols":3,"rows_kept":35,"cut":false,"hidden":false,"merged":[]}
["Relative Price Submission"]
["Reference Tables"]
[]
[]
[null,"Table D.1 - Hospital Types"]
[null,"Hospital Type Code","Description"]
[null,1,"Acute Hospital"]
[null,2,"Psychiatric or Substance Abuse Hospital or Acute Hospital Behavioral Health only"]
[null,3,"Chronic Hospital"]
[null,4,"Rehabilitation Hospital"]
[]
[]
[null,"Table D.2 - Insurance Categories"]
[null,"Insurance Category Code ","Description"]
[null,1,"Medicare Advantage"]
[null,2,"Medicaid MCO/ACO-A"]
[null,3,"Commercial (self and fully insured)"]
[null,4,"SCO"]
[null,5,"OneCare"]
[null,6,"Other"]
[]
[]
[null,"Table D.3 - Product Types"]
[null,"Product Type Code","Description"]
[null,1,"HMO and POS"]
[null,2,"PPO"]
[null,3,"Indemnity"]
[null,4,"Other"]
[]
[]
[null,"Table D.4 - Multiplier Indicators"]
[null,"Service Multiplier Indicator","Description"]
[null,1,"Negotiated multiplier (not calculated)"]
[null,2,"Calculated payment-derived multiplier"]
[null,3,"Standard per unit rate "]

{"sheet":"Multiplier Review","index":5,"n_rows":4,"n_cols":10,"rows_kept":4,"cut":false,"hidden":false,"merged":[]}
["Please review the Range of Multipliers reported for each Service"]
[]
["Table F.1: Multiplier Summary"]
["OtherProviderType","InsuranceCategoryCode","ProductTypeCode","Service","Min of Multiplier","Max of Multiplier","Average of Multiplier","Min of Total Payments","Max of Total Payments","Average of Total Payments"]

{"sheet":"Payments Review","index":6,"n_rows":4,"n_cols":7,"rows_kept":4,"cut":false,"hidden":false,"merged":[]}
["Please review the Total Payments reported for each Other Provider Group"]
[]
["Table E.1: Payment Summary"]
["ProviderGroupOrgID","LocalPracticeOrgID","InsuranceCategoryCode","ProductTypeCode","Sum of ClaimsPayments","Sum of NonClaimsPayments","Sum of Total Payments"]

{"sheet":"Service Review","index":7,"n_rows":4,"n_cols":7,"rows_kept":4,"cut":false,"hidden":false,"merged":[]}
["Please review the Services reported for each Other Provider Group"]
[]
["Table G.1: Service Group Summary"]
["ProviderGroupOrgID","LocalPracticeOrgID","InsuranceCategoryCode","ProductTypeCode","Service","Count of Multiplier","Data Review"]

{"sheet":"Payers","index":8,"n_rows":19,"n_cols":3,"rows_kept":19,"cut":false,"hidden":true,"merged":[]}
["OrgID","Payer Name","ShortName"]
[null,"Select Payer:","Select Payer:"]
[290,"Aetna Health Inc. (PA) - Aetna Life Ins. Co. (ALIC)","Aetna"]
[291,"Blue Cross Blue Shield of Massachusetts","BCBS"]
[296,"Fallon Community Health Plan","Fallon"]
[300,"Harvard Pilgrim Health Care","HPHC"]
[301,"Health New England, Inc.","HNE"]
[308,"Tufts Associated Health Maintenance Organization, Inc.","THP"]
[310,"UniCare Life and Health Insurance Company","Unicare"]
[312,"United Healthcare Insurance Company","United"]
[3156,"MassHealth","MassHealth"]
[3735,"AllWays Health Partners, Inc.","Allways"]
[12103,"Tufts Medicare Advantage","TuftsMedicare"]
[10728,"Commonwealth Care Alliance","CCA"]
[10926,"United Healthcare Insurance Company - Medicare Advantage","UnitedMedicare"]
[11226,"BMC HealthNet Plan, Inc. (Medicaid MCO)","BMCHP"]
[11227,"Network Health, LLC  (Medicaid MCO)","THPP"]
[11474,"CIGNA Health and Life Insurance Company (CHLIC)","Cigna"]
[12814,"United Healthcare Insurance - Medicare & Retirement (SCO)","UnitedSCO"]

{"sheet":"System Data","index":9,"n_rows":38,"n_cols":4,"rows_kept":38,"cut":false,"hidden":true,"merged":[]}
[true,"OnSaveFlag",{"$f":"ROWS(_xlfn._xlws.FILTER('Other Provider List'!A:B,('Other Provider List'!A:A<>\"\")+('Other Provider List'!B:B<>\"\")))","v":1071},"Org Count"]
[1,"iPayer",{"$f":"ROWS(_xlfn._xlws.FILTER('Other Provider Data'!A:J,('Other Provider Data'!A:A<>\"\")+('Other Provider Data'!B:B<>\"\")+('Other Provider Data'!C:C<>\"\")+('Other Provider Data'!D:D<>\"\")+('Other Provider Data'!E:E<>\"\")+('Other Provider Data'!F:F<>\"\")+('Other Provider Data'!G:G<>\"\")+('Other Provider Data'!H:H<>\"\")+('Other Provider Data'!I:I<>\"\")))+1","v":2},"Data Count"]
[{"$f":"A4&\"_\"&A5&\"_\"&A6&\"_\"&A7&\"_\"&A8&\".xlsm\"","v":"0_Select Payer:_0_116_PG.xlsm"},"vFileName"]
[{"$f":"IF(ISBLANK(iPayer),\"\",INDEX(PayersList,iPayer,1))","v":0},"vPayerOrgID"]
[{"$f":"IF(ISBLANK(iPayer),\"\",INDEX(PayersList,iPayer,3))","v":"Select Payer:"},"vPayerShortName"]
[{"$f":"'Front Page'!C12","v":0},"vYear"]
[116,"FilingTypeID"]
["PG","TemplateType"]
[]
[]
[]
[]
[]
[]
[]
[]
[]
[{"$f":"IF(AND(A19=TRUE,A34=TRUE),TRUE,FALSE)","v":false},"cfAllFrontPageRequriedFields"]
[{"$f":"IF(AND(A20=TRUE,A21=TRUE,A23=TRUE,A24=TRUE,A25=TRUE,A26),TRUE,FALSE)","v":false},"A. FrontPage WorkSheet"]
[{"$f":"IF('Front Page'!B6=\"\",  FALSE, TRUE)","v":false},"vContactName"]
[{"$f":"IF(OR('Front Page'!B7=\"\",'Front Page'!C7=\"ERROR: Please enter a valid email address\"),FALSE,TRUE)","v":false},"vContactEmail"]
[null,"cfFrontPageTableA1RequiredFields"]
[{"$f":"IF(OR('Front Page'!C10=\"\",'Front Page'!C10=0),FALSE,TRUE)","v":false},"vPayerOrgID"]
[{"$f":"IF(OR('Front Page'!C11=\"\",'Front Page'!C11=\"Select Payer:\"),FALSE,TRUE)","v":false},"vPayerName"]
[{"$f":"IF('Front Page'!C12=\"\", FALSE,TRUE)","v":false},"vSubmissionYear"]
[{"$f":"IF('Front Page'!C13=\"\", FALSE,TRUE)","v":false},"vDataYear"]
[]
[]
[{"$f":"IF(AND(A30=TRUE,A31=TRUE),TRUE,FALSE)","v":false},"cfFrontPageTableA2RequiredFields"]
[{"$f":"IF(ISNUMBER(SEARCH(\"All entered data is valid\",'Front Page'!C19)), TRUE,FALSE)","v":false},"vPhysicianGroupDataTab"]
[{"$f":"IF(ISNUMBER(SEARCH(\"All entered data is valid\",'Front Page'!C20)), TRUE,FALSE)","v":false},"vServiceReviewTab"]
[]
[]
[{"$f":"IF(AND(A35=TRUE,A36=TRUE,A37=TRUE,A38=TRUE),TRUE,FALSE)","v":false},"cfFrontPageTableA3RequiredFields"]
[{"$f":"IF('Front Page'!C25=\"\", FALSE,TRUE)","v":false},"vAcknowledgeReviewedOther ProviderDataTab"]
[{"$f":"IF('Front Page'!C26=\"\",FALSE,TRUE)","v":false},"vAcknowledgeReviewedPaymentsReviewTab"]
[{"$f":"IF('Front Page'!C27=\"\",FALSE,TRUE)","v":false},"vAcknowledgeReviewedMultiplierReviewTab"]
[{"$f":"IF('Front Page'!C28=\"\",FALSE,TRUE)","v":false},"vAcknowledgeReviewedServiceReviewTab"]