{"text_format":"1","workbook":"xlsx","n_sheets":9,"sheets":["Contents","A. Front Page","B. Zip Code","C. Physician Group","D.1 Summary","D.2 Summary Trends","Reference Tables","Payer Names","System Data"],"not_rendered":{"charts":0,"images":0,"macros":1,"external_links":0,"defined_names":21,"comments":0,"pivot_tables":0},"unopened":[],"bounds":{"document_bytes":16777216,"sheet_cells":100000,"rows_first":2000,"rows_last":500,"rows_between":2000,"halvings":0,"cell_chars":16384,"cell_head_chars":4096},"cells_cut":0,"cells_raw":0,"read":"whole","date_system":"1900"}

{"sheet":"Contents","index":0,"n_rows":15,"n_cols":2,"rows_kept":15,"cut":false,"hidden":false,"merged":[]}
["Total Medical Expenses and Alternative Payment Methods"]
["DRAFT Data Submission Workbook: 2019 Reporting Cycle"]
[]
["CHIA Submissions Portal"]
["TME/APM Data Specification Manual "]
[]
["This workbook contains the following tabs:"]
[]
["Tab Name","Contents"]
["A. Front Page","Payer Data Entry: Overview of File and Data Verification"]
{"$rows_left_out":6}
{"sheet":"A. Front Page","index":1,"n_rows":43,"n_cols":5,"rows_kept":43,"cut":false,"hidden":false,"merged":[[34,1,34,4],[8,1,8,2],[20,1,20,2]]}
["Total Medical Expenses and Alternative Payment Methods"]
["A. File Overview and Payer Verification"]
[]
[]
[null,"I verify that the information in this workbook is accurate."]
["Contact Name:","CHIA Test ","[Input Required]"]
["Contact Email:","Erin.Bonney@state.ma.us ","[Input Required]"]
[]
[null,"Table A.1: File Overview",null,"[Input Required]"]
[null,"Payer Name  *",{"$f":"IF(ISBLANK(iPayer), \"\",INDEX(PayersList,iPayer,2))","v":"CHIA"}]
{"$rows_left_out":34}
{"sheet":"B. Zip Code","index":2,"n_rows":40,"n_cols":16,"rows_kept":40,"cut":false,"hidden":false,"merged":[]}
["Total Medical Expenses and Alternative Payment Methods",null,null,null,null,null,null,null,null,""]
["B. Zip Code TME and APM Records"]
["[All columns must be filled in*]"]
["Submission Type *","Reporting Year   *","Zip Code  *","Insurance Category     Code *","Product Type    Code *","PCP Type Indicator  *","Payment Method    Code  *","Member Months *","HSA Score *","Claims: Hospital Inpatient  *","Claims: Hospital Outpatient  *","Claims: Professional Physician  *","Claims: Professional Other  *","Claims: Pharmacy   *","Claims: Other  *","Total Non-Claims Payments   *"]
["F",2016,"02114",1,1,1,5,20740,0.50249999999999995,6156550,2826744.1199999996,4411205.79,2310470.37,4370704.75,1981872.76,25729.99]
["F",2016,"02114",2,1,1,5,4515340,2.1117197552397147,459129198,428304598.18000001,282237759.61999995,75536873.020000011,507273864.62000006,169391362.82000005,225225369.97999993]
["F",2016,"01095",3,1,1,"1A",1281073,0.41249999999999998,66732012,67975128.489999995,100462632.48,29423088.960000001,111864210.73,97358016.299999997,661660.12]
["F",2016,"01095",3,2,2,2,407587,0.67999999999999994,19074608,32444896.160000004,18578466.039999999,2944202.08,32534382.23,8123214.0600000005,5589337.4100000001]
["F",2016,"02134",3,1,1,5,155106,0.35599999999999998,8026843,17790988.810000002,14511843.459999997,3717336.2800000003,14149304.859999999,2814996.42,0]
["F",2016,"02445",3,1,1,5,6731200,0.74564207239062097,622756852,831061686.13999975,1088318928.01,169477526.54999998,596103527.36000013,129086284.45,86302277.723700002]
{"$rows_left_out":31}
{"sheet":"C. Physician Group","index":3,"n_rows":40,"n_cols":24,"rows_kept":40,"cut":false,"hidden":false,"merged":[]}
["Total Medical Expenses and Alternative Payment Methods"]
["C. Physician Group TME and APM Records"]
["[All columns must be filled in*]"]
["Submission Type  *","Reporting Year  *","Physician Group OrgID   *","Local Practice Group       OrgID   *","Insurance Category       Code   *","Product Type Code  *","PCP Type Indicator  *","Payment Method      Code  *","Risk Type     Code  *","Pediatric Indicator  *","MassHealth ACO           Indicator   *","Member Months  *","HSA Score  *","Claims: Hospital Inpatient  *","Claims: Hospital Outpatient  *","Claims: Professional Physician  *","Claims: Professional Other  *","Claims: Pharmacy   *","Claims:      Other  *","Non-Claims: Incentive Programs   *","Non-Claims: Capitation   *","Non-Claims: Risk Settlements   *","Non-Claims: Care Management *","Non-Claims: Other   *"]
["F",2016,12345,11111,1,1,1,5,2,0,0,20740,0.50249999999999995,6156550,2826744.1199999996,4411205.79,2310470.37,4370704.75,1981888.76,25729.99]
["F",2016,23456,11112,2,1,1,5,1,0,1,4515450,2.1117197552397147,459129198,428304598.18000001,282237759.61999995,75536873.020000011,507273864.62000006,169391362.82000005,225225369.97999993]
["F",2016,34567,11113,3,1,1,"1A",1,0,0,1281073,0.41249999999999998,66732012,67975128.489999995,100462632.48,29423087.960000001,111864210.73,97358016.299999997,661651.12]
["F",2016,45678,11114,3,2,2,2,1,0,0,407587,0.67999999999999994,19074608,32444896.160000004,18578466.039999999,2944202.08,32534382.23,8123214.0600000005,5589337.4100000001]
["F",2016,12345,11111,3,1,1,5,1,0,0,155106,0.35599999999999998,8026843,17790988.810000002,14511843.459999997,3717336.2800000003,14149304.859999999,2814996.42,0]
["F",2016,23456,11112,3,1,1,5,1,0,1,6731200,0.74564207239062097,622756852,831061686.13999975,1088318928.01,169477526.54999998,596103527.36000013,129086284.45,86302277.723700002]
{"$rows_left_out":31}
{"sheet":"D.1 Summary","index":4,"n_rows":50,"n_cols":17,"rows_kept":50,"cut":false,"hidden":false,"merged":[[2,1,2,16],[27,1,27,16]]}
[]
["Table A: Zip Code TME&APM Summary "]
[null,"TME and APM Data Summary - Zip Code"]
[null,"Year","Insurance Category ","Code","Member Months  ","Wtd Member Months "," Average HSA ","Total Expenses","TME PMPM ","HSA TME PMPM"," Inpatient","Outpatient","Prof. Physician","Prof. Other","Rx ","Other","Non-Claims "]
[null,2016,"Medicare & Medicare Advantage ",1,{"$f":"SUMIFS('B. Zip Code'!H:H,'B. Zip Code'!B:B,'D.1 Summary'!B5,'B. Zip Code'!D:D,D5)","v":20740},{"$f":"IFERROR((SUMIFS('B. Zip Code'!H:H,'B. Zip Code'!B:B,'D.1 Summary'!B5,'B. Zip Code'!D:D,D5)*AVERAGEIFS('B. Zip Code'!I:I,'B. Zip Code'!B:B,'D.1 Summary'!B5,'B. Zip Code'!D:D,D5)),\"0\")","v":10421.849999999999},{"$f":"IFERROR(F5/E5,\"0\")","v":0.50249999999999995},{"$f":"(SUMIFS('B. Zip Code'!J:J,'B. Zip Code'!B:B,'D.1 Summary'!B5,'B. Zip Code'!D:D,'D.1 Summary'!D5)+SUMIFS('B. Zip Code'!K:K,'B. Zip Code'!B:B,'D.1 Summary'!B5,'B. Zip Code'!D:D,'D.1 Summary'!D5)+SUMIFS('B. Zip Code'!L:L,'B. Zip Code'!B:B,'D.1 Summary'!B5,'B. Zip Code'!D:D,'D.1 Summary'!D5)+SUMIFS('B. Zip Code'!M:M,'B. Zip Code'!B:B,'D.1 Summary'!B5,'B. Zip Code'!D:D,'D.1 Summary'!D5)+SUMIFS('B. Zip Code'!N:N,'B. Zip Code'!B:B,'D.1 Summary'!B5,'B. Zip Code'!D:D,'D.1 Summary'!D5)+SUMIFS('B. Zip Code'!O:O,'B. Zip Code'!B:B,'D.1 Summary'!B5,'B. Zip Code'!D:D,'D.1 Summary'!D5)+SUMIFS('B. Zip Code'!P:P,'B. Zip Code'!B:B,'D.1 Summary'!B5,'B. Zip Code'!D:D,'D.1 Summary'!D5))","v":22083277.780000001},{"$f":"IFERROR(H5/E5,\"0\")","v":1064.7674918032787},{"$f":"IFERROR(H5/F5,\"0\")","v":2118.94028219558},{"$f":"SUMIFS('B. Zip Code'!J:J,'B. Zip Code'!B:B,'D.1 Summary'!B5,'B. Zip Code'!D:D,D5)","v":6156550},{"$f":"SUMIFS('B. Zip Code'!K:K,'B. Zip Code'!B:B,'D.1 Summary'!B5,'B. Zip Code'!D:D,D5)","v":2826744.1199999996},{"$f":"SUMIFS('B. Zip Code'!L:L,'B. Zip Code'!B:B,'D.1 Summary'!B5,'B. Zip Code'!D:D,D5)","v":4411205.79},{"$f":"SUMIFS('B. Zip Code'!M:M,'B. Zip Code'!B:B,'D.1 Summary'!B5,'B. Zip Code'!D:D,D5)","v":2310470.37},{"$f":"SUMIFS('B. Zip Code'!N:N,'B. Zip Code'!B:B,'D.1 Summary'!B5,'B. Zip Code'!D:D,D5)","v":4370704.75},{"$f":"SUMIFS('B. Zip Code'!O:O,'B. Zip Code'!B:B,'D.1 Summary'!B5,'B. Zip Code'!D:D,D5)","v":1981872.76},{"$f":"SUMIFS('B. Zip Code'!P:P,'B. Zip Code'!B:B,'D.1 Summary'!B5,'B. Zip Code'!D:D,D5)","v":25729.99}]
[null,2016,"Medicaid & Medicaid Managed Care (MCO)",2,{"$f":"SUMIFS('B. Zip Code'!H:H,'B. Zip Code'!B:B,'D.1 Summary'!B6,'B. Zip Code'!D:D,D6)","v":4515340},{"$f":"IFERROR((SUMIFS('B. Zip Code'!H:H,'B. Zip Code'!B:B,'D.1 Summary'!B6,'B. Zip Code'!D:D,D6)*AVERAGEIFS('B. Zip Code'!I:I,'B. Zip Code'!B:B,'D.1 Summary'!B6,'B. Zip Code'!D:D,D6)),\"0\")","v":9535132.6796240937},{"$f":"IFERROR(F6/E6,\"0\")","v":2.1117197552397147},{"$f":"(SUMIFS('B. Zip Code'!J:J,'B. Zip Code'!B:B,'D.1 Summary'!B6,'B. Zip Code'!D:D,'D.1 Summary'!D6)+SUMIFS('B. Zip Code'!K:K,'B. Zip Code'!B:B,'D.1 Summary'!B6,'B. Zip Code'!D:D,'D.1 Summary'!D6)+SUMIFS('B. Zip Code'!L:L,'B. Zip Code'!B:B,'D.1 Summary'!B6,'B. Zip Code'!D:D,'D.1 Summary'!D6)+SUMIFS('B. Zip Code'!M:M,'B. Zip Code'!B:B,'D.1 Summary'!B6,'B. Zip Code'!D:D,'D.1 Summary'!D6)+SUMIFS('B. Zip Code'!N:N,'B. Zip Code'!B:B,'D.1 Summary'!B6,'B. Zip Code'!D:D,'D.1 Summary'!D6)+SUMIFS('B. Zip Code'!O:O,'B. Zip Code'!B:B,'D.1 Summary'!B6,'B. Zip Code'!D:D,'D.1 Summary'!D6)+SUMIFS('B. Zip Code'!P:P,'B. Zip Code'!B:B,'D.1 Summary'!B6,'B. Zip Code'!P:P,'D.1 Summary'!D6))","v":1921873656.2600002},{"$f":"IFERROR(H6/E6,\"0\")","v":425.63210218056673},{"$f":"IFERROR(H6/F6,\"0\")","v":201.55709635450683},{"$f":"SUMIFS('B. Zip Code'!J:J,'B. Zip Code'!B:B,'D.1 Summary'!B6,'B. Zip Code'!D:D,D6)","v":459129198},{"$f":"SUMIFS('B. Zip Code'!K:K,'B. Zip Code'!B:B,'D.1 Summary'!B6,'B. Zip Code'!D:D,D6)","v":428304598.18000001},{"$f":"SUMIFS('B. Zip Code'!L:L,'B. Zip Code'!B:B,'D.1 Summary'!B6,'B. Zip Code'!D:D,D6)","v":282237759.61999995},{"$f":"SUMIFS('B. Zip Code'!M:M,'B. Zip Code'!B:B,'D.1 Summary'!B6,'B. Zip Code'!D:D,D6)","v":75536873.020000011},{"$f":"SUMIFS('B. Zip Code'!N:N,'B. Zip Code'!B:B,'D.1 Summary'!B6,'B. Zip Code'!D:D,D6)","v":507273864.62000006},{"$f":"SUMIFS('B. Zip Code'!O:O,'B. Zip Code'!B:B,'D.1 Summary'!B6,'B. Zip Code'!D:D,D6)","v":169391362.82000005},{"$f":"SUMIFS('B. Zip Code'!P:P,'B. Zip Code'!B:B,'D.1 Summary'!B6,'B. Zip Code'!D:D,D6)","v":225225369.97999993}]
[null,2016,"Commercial - Full Claims",3,{"$f":"SUMIFS('B. Zip Code'!H:H,'B. Zip Code'!B:B,'D.1 Summary'!B7,'B. Zip Code'!D:D,D7)","v":8574966},{"$f":"IFERROR((SUMIFS('B. Zip Code'!H:H,'B. Zip Code'!B:B,'D.1 Summary'!B7,'B. Zip Code'!D:D,D7)*AVERAGEIFS('B. Zip Code'!I:I,'B. Zip Code'!B:B,'D.1 Summary'!B7,'B. Zip Code'!D:D,D7)),\"0\")","v":4703673.4174797777},0.54853551809765522,{"$f":"(SUMIFS('B. Zip Code'!J:J,'B. Zip Code'!B:B,'D.1 Summary'!B7,'B. Zip Code'!D:D,'D.1 Summary'!D7)+SUMIFS('B. Zip Code'!K:K,'B. Zip Code'!B:B,'D.1 Summary'!B7,'B. Zip Code'!D:D,'D.1 Summary'!D7)+SUMIFS('B. Zip Code'!L:L,'B. Zip Code'!B:B,'D.1 Summary'!B7,'B. Zip Code'!D:D,'D.1 Summary'!D7)+SUMIFS('B. Zip Code'!M:M,'B. Zip Code'!B:B,'D.1 Summary'!B7,'B. Zip Code'!D:D,'D.1 Summary'!D7)+SUMIFS('B. Zip Code'!N:N,'B. Zip Code'!B:B,'D.1 Summary'!B7,'B. Zip Code'!D:D,'D.1 Summary'!D7)+SUMIFS('B. Zip Code'!O:O,'B. Zip Code'!B:B,'D.1 Summary'!B7,'B. Zip Code'!D:D,'D.1 Summary'!D7)+SUMIFS('B. Zip Code'!P:P,'B. Zip Code'!B:B,'D.1 Summary'!B7,'B. Zip Code'!P:P,'D.1 Summary'!D7))","v":4085330974.8700004},476.42532633598785,868.5405240270519,{"$f":"SUMIFS('B. Zip Code'!J:J,'B. Zip Code'!B:B,'D.1 Summary'!B7,'B. Zip Code'!D:D,D7)","v":716590315},{"$f":"SUMIFS('B. Zip Code'!K:K,'B. Zip Code'!B:B,'D.1 Summary'!B7,'B. Zip Code'!D:D,D7)","v":949272699.59999979},{"$f":"SUMIFS('B. Zip Code'!L:L,'B. Zip Code'!B:B,'D.1 Summary'!B7,'B. Zip Code'!D:D,D7)","v":1221871869.99},{"$f":"SUMIFS('B. Zip Code'!M:M,'B. Zip Code'!B:B,'D.1 Summary'!B7,'B. Zip Code'!D:D,D7)","v":205562153.86999997},{"$f":"SUMIFS('B. Zip Code'!N:N,'B. Zip Code'!B:B,'D.1 Summary'!B7,'B. Zip Code'!D:D,D7)","v":754651425.18000007},{"$f":"SUMIFS('B. Zip Code'!O:O,'B. Zip Code'!B:B,'D.1 Summary'!B7,'B. Zip Code'!D:D,D7)","v":237382511.23000002},{"$f":"SUMIFS('B. Zip Code'!P:P,'B. Zip Code'!B:B,'D.1 Summary'!B7,'B. Zip Code'!D:D,D7)","v":92553275.253700003}]
[null,2016,"Commercial - Partial Claims",4,{"$f":"SUMIFS('B. Zip Code'!H:H,'B. Zip Code'!B:B,'D.1 Summary'!B8,'B. Zip Code'!D:D,D8)","v":1723762},{"$f":"IFERROR((SUMIFS('B. Zip Code'!H:H,'B. Zip Code'!B:B,'D.1 Summary'!B8,'B. Zip Code'!D:D,D8)*AVERAGEIFS('B. Zip Code'!I:I,'B. Zip Code'!B:B,'D.1 Summary'!B8,'B. Zip Code'!D:D,D8)),\"0\")","v":1529838.7749999997},0.88749999999999984,{"$f":"(SUMIFS('B. Zip Code'!J:J,'B. Zip Code'!B:B,'D.1 Summary'!B8,'B. Zip Code'!D:D,'D.1 Summary'!D8)+SUMIFS('B. Zip Code'!K:K,'B. Zip Code'!B:B,'D.1 Summary'!B8,'B. Zip Code'!D:D,'D.1 Summary'!D8)+SUMIFS('B. Zip Code'!L:L,'B. Zip Code'!B:B,'D.1 Summary'!B8,'B. Zip Code'!D:D,'D.1 Summary'!D8)+SUMIFS('B. Zip Code'!M:M,'B. Zip Code'!B:B,'D.1 Summary'!B8,'B. Zip Code'!D:D,'D.1 Summary'!D8)+SUMIFS('B. Zip Code'!N:N,'B. Zip Code'!B:B,'D.1 Summary'!B8,'B. Zip Code'!D:D,'D.1 Summary'!D8)+SUMIFS('B. Zip Code'!O:O,'B. Zip Code'!B:B,'D.1 Summary'!B8,'B. Zip Code'!D:D,'D.1 Summary'!D8)+SUMIFS('B. Zip Code'!P:P,'B. Zip Code'!B:B,'D.1 Summary'!B8,'B. Zip Code'!P:P,'D.1 Summary'!D8))","v":616176943.21000004},357.4605677639953,402.77247071999477,{"$f":"SUMIFS('B. Zip Code'!J:J,'B. Zip Code'!B:B,'D.1 Summary'!B8,'B. Zip Code'!D:D,D8)","v":119380734},{"$f":"SUMIFS('B. Zip Code'!K:K,'B. Zip Code'!B:B,'D.1 Summary'!B8,'B. Zip Code'!D:D,D8)","v":134471593.5},{"$f":"SUMIFS('B. Zip Code'!L:L,'B. Zip Code'!B:B,'D.1 Summary'!B8,'B. Zip Code'!D:D,D8)","v":183904156.17000002},{"$f":"SUMIFS('B. Zip Code'!M:M,'B. Zip Code'!B:B,'D.1 Summary'!B8,'B. Zip Code'!D:D,D8)","v":28387520.120000001},{"$f":"SUMIFS('B. Zip Code'!N:N,'B. Zip Code'!B:B,'D.1 Summary'!B8,'B. Zip Code'!D:D,D8)","v":71538834.319999993},{"$f":"SUMIFS('B. Zip Code'!O:O,'B. Zip Code'!B:B,'D.1 Summary'!B8,'B. Zip Code'!D:D,D8)","v":78494105.099999994},{"$f":"SUMIFS('B. Zip Code'!P:P,'B. Zip Code'!B:B,'D.1 Summary'!B8,'B. Zip Code'!D:D,D8)","v":436988.56}]
[null,2016,"Medicare and Medicaid Dual Eligibles ages 65 and over",5,{"$f":"SUMIFS('B. Zip Code'!H:H,'B. Zip Code'!B:B,'D.1 Summary'!B9,'B. Zip Code'!D:D,D9)","v":176913},{"$f":"IFERROR((SUMIFS('B. Zip Code'!H:H,'B. Zip Code'!B:B,'D.1 Summary'!B9,'B. Zip Code'!D:D,D9)*AVERAGEIFS('B. Zip Code'!I:I,'B. Zip Code'!B:B,'D.1 Summary'!B9,'B. Zip Code'!D:D,D9)),\"0\")","v":604157.89500000002},3.415,{"$f":"(SUMIFS('B. Zip Code'!J:J,'B. Zip Code'!B:B,'D.1 Summary'!B9,'B. Zip Code'!D:D,'D.1 Summary'!D9)+SUMIFS('B. Zip Code'!K:K,'B. Zip Code'!B:B,'D.1 Summary'!B9,'B. Zip Code'!D:D,'D.1 Summary'!D9)+SUMIFS('B. Zip Code'!L:L,'B. Zip Code'!B:B,'D.1 Summary'!B9,'B. Zip Code'!D:D,'D.1 Summary'!D9)+SUMIFS('B. Zip Code'!M:M,'B. Zip Code'!B:B,'D.1 Summary'!B9,'B. Zip Code'!D:D,'D.1 Summary'!D9)+SUMIFS('B. Zip Code'!N:N,'B. Zip Code'!B:B,'D.1 Summary'!B9,'B. Zip Code'!D:D,'D.1 Summary'!D9)+SUMIFS('B. Zip Code'!O:O,'B. Zip Code'!B:B,'D.1 Summary'!B9,'B. Zip Code'!D:D,'D.1 Summary'!D9)+SUMIFS('B. Zip Code'!P:P,'B. Zip Code'!B:B,'D.1 Summary'!B9,'B. Zip Code'!P:P,'D.1 Summary'!D9))","v":435579075.44},2462.108920429816,720.96893716832085,{"$f":"SUMIFS('B. Zip Code'!J:J,'B. Zip Code'!B:B,'D.1 Summary'!B9,'B. Zip Code'!D:D,D9)","v":56814261},{"$f":"SUMIFS('B. Zip Code'!K:K,'B. Zip Code'!B:B,'D.1 Summary'!B9,'B. Zip Code'!D:D,D9)","v":41577415.559999995},{"$f":"SUMIFS('B. Zip Code'!L:L,'B. Zip Code'!B:B,'D.1 Summary'!B9,'B. Zip Code'!D:D,D9)","v":5801165.7699999996},{"$f":"SUMIFS('B. Zip Code'!M:M,'B. Zip Code'!B:B,'D.1 Summary'!B9,'B. Zip Code'!D:D,D9)","v":2266925.87},{"$f":"SUMIFS('B. Zip Code'!N:N,'B. Zip Code'!B:B,'D.1 Summary'!B9,'B. Zip Code'!D:D,D9)","v":75656893.979999989},{"$f":"SUMIFS('B. Zip Code'!O:O,'B. Zip Code'!B:B,'D.1 Summary'!B9,'B. Zip Code'!D:D,D9)","v":253462413.25999999},{"$f":"SUMIFS('B. Zip Code'!P:P,'B. Zip Code'!B:B,'D.1 Summary'!B9,'B. Zip Code'!D:D,D9)","v":61044343.780000001}]
[null,2016,"Medicare and Medicaid Dual Eligibles afes 21-64",6,{"$f":"SUMIFS('B. Zip Code'!H:H,'B. Zip Code'!B:B,'D.1 Summary'!B10,'B. Zip Code'!D:D,D10)","v":32422},{"$f":"IFERROR((SUMIFS('B. Zip Code'!H:H,'B. Zip Code'!B:B,'D.1 Summary'!B10,'B. Zip Code'!D:D,D10)*AVERAGEIFS('B. Zip Code'!I:I,'B. Zip Code'!B:B,'D.1 Summary'!B10,'B. Zip Code'!D:D,D10)),\"0\")","v":53973.623888888898},1.6647222222222224,{"$f":"(SUMIFS('B. Zip Code'!J:J,'B. Zip Code'!B:B,'D.1 Summary'!B10,'B. Zip Code'!D:D,'D.1 Summary'!D10)+SUMIFS('B. Zip Code'!K:K,'B. Zip Code'!B:B,'D.1 Summary'!B10,'B. Zip Code'!D:D,'D.1 Summary'!D10)+SUMIFS('B. Zip Code'!L:L,'B. Zip Code'!B:B,'D.1 Summary'!B10,'B. Zip Code'!D:D,'D.1 Summary'!D10)+SUMIFS('B. Zip Code'!M:M,'B. Zip Code'!B:B,'D.1 Summary'!B10,'B. Zip Code'!D:D,'D.1 Summary'!D10)+SUMIFS('B. Zip Code'!N:N,'B. Zip Code'!B:B,'D.1 Summary'!B10,'B. Zip Code'!D:D,'D.1 Summary'!D10)+SUMIFS('B. Zip Code'!O:O,'B. Zip Code'!B:B,'D.1 Summary'!B10,'B. Zip Code'!D:D,'D.1 Summary'!D10)+SUMIFS('B. Zip Code'!P:P,'B. Zip Code'!B:B,'D.1 Summary'!B10,'B. Zip Code'!P:P,'D.1 Summary'!D10))","v":72958713.059599996},2250.2841607427054,1351.7475352367326,{"$f":"SUMIFS('B. Zip Code'!J:J,'B. Zip Code'!B:B,'D.1 Summary'!B10,'B. Zip Code'!D:D,D10)","v":19504180},{"$f":"SUMIFS('B. Zip Code'!K:K,'B. Zip Code'!B:B,'D.1 Summary'!B10,'B. Zip Code'!D:D,D10)","v":12027162.459799999},{"$f":"SUMIFS('B. Zip Code'!L:L,'B. Zip Code'!B:B,'D.1 Summary'!B10,'B. Zip Code'!D:D,D10)","v":5228848.3101000004},{"$f":"SUMIFS('B. Zip Code'!M:M,'B. Zip Code'!B:B,'D.1 Summary'!B10,'B. Zip Code'!D:D,D10)","v":3118472.1498999996},{"$f":"SUMIFS('B. Zip Code'!N:N,'B. Zip Code'!B:B,'D.1 Summary'!B10,'B. Zip Code'!D:D,D10)","v":20527641.6899},{"$f":"SUMIFS('B. Zip Code'!O:O,'B. Zip Code'!B:B,'D.1 Summary'!B10,'B. Zip Code'!D:D,D10)","v":12552408.449899999},{"$f":"SUMIFS('B. Zip Code'!P:P,'B. Zip Code'!B:B,'D.1 Summary'!B10,'B. Zip Code'!D:D,D10)","v":0}]
{"$rows_left_out":41}
{"sheet":"D.2 Summary Trends","index":5,"n_rows":61,"n_cols":17,"rows_kept":61,"cut":false,"hidden":false,"merged":[[45,1,45,8],[2,1,2,16],[27,1,27,8]]}
[]
["Table C: Zip Code and Physician Group TME&APM Comparison "]
[null,"Percent Difference in Zip Code and Physician Group TME-APM"]
[null,"Year","Insurance Category ","Code","Member Months  ","Wtd Member Months "," Average HSA ","Total Expenses","TME PMPM ","HSA TME PMPM"," Inpatient","Outpatient","Prof. Physician","Prof. Other","Rx ","Other","Non-Claims "]
[null,2016,"Medicare & Medicare Advantage ",1,{"$f":"'D.1 Summary'!E30-'D.1 Summary'!E5","v":0},{"$f":"'D.1 Summary'!F30-'D.1 Summary'!F5","v":0},{"$f":"IFERROR((('D.1 Summary'!G30-'D.1 Summary'!G5)/'D.1 Summary'!G5),\"---\")","v":0},{"$f":"'D.1 Summary'!H30-'D.1 Summary'!H5","v":16},{"$f":"'D.1 Summary'!I30-'D.1 Summary'!I5","v":7.7145612340245862E-4},{"$f":"'D.1 Summary'!J30-'D.1 Summary'!J5","v":1.535236066501966E-3},{"$f":"'D.1 Summary'!K30-'D.1 Summary'!K5","v":0},{"$f":"'D.1 Summary'!L30-'D.1 Summary'!L5","v":0},{"$f":"'D.1 Summary'!M30-'D.1 Summary'!M5","v":0},{"$f":"'D.1 Summary'!N30-'D.1 Summary'!N5","v":0},{"$f":"'D.1 Summary'!O30-'D.1 Summary'!O5","v":0},{"$f":"'D.1 Summary'!P30-'D.1 Summary'!P5","v":16},{"$f":"'D.1 Summary'!Q30-'D.1 Summary'!Q5","v":0}]
[null,2016,"Medicaid & Medicaid Managed Care (MCO)",2,{"$f":"'D.1 Summary'!E31-'D.1 Summary'!E6","v":110},{"$f":"'D.1 Summary'!F31-'D.1 Summary'!F6","v":232.28917307592928},{"$f":"IFERROR((('D.1 Summary'!G31-'D.1 Summary'!G6)/'D.1 Summary'!G6),\"---\")","v":0},{"$f":"'D.1 Summary'!H31-'D.1 Summary'!H6","v":225225369.98000002},{"$f":"'D.1 Summary'!I31-'D.1 Summary'!I6","v":49.868462821814035},{"$f":"'D.1 Summary'!J31-'D.1 Summary'!J6","v":23.615095089240725},{"$f":"'D.1 Summary'!K31-'D.1 Summary'!K6","v":0},{"$f":"'D.1 Summary'!L31-'D.1 Summary'!L6","v":0},{"$f":"'D.1 Summary'!M31-'D.1 Summary'!M6","v":0},{"$f":"'D.1 Summary'!N31-'D.1 Summary'!N6","v":0},{"$f":"'D.1 Summary'!O31-'D.1 Summary'!O6","v":0},{"$f":"'D.1 Summary'!P31-'D.1 Summary'!P6","v":0},{"$f":"'D.1 Summary'!Q31-'D.1 Summary'!Q6","v":0}]
[null,2016,"Commercial - Full Claims",3,{"$f":"'D.1 Summary'!E32-'D.1 Summary'!E7","v":0},{"$f":"'D.1 Summary'!F32-'D.1 Summary'!F7","v":0},{"$f":"IFERROR((('D.1 Summary'!G32-'D.1 Summary'!G7)/'D.1 Summary'!G7),\"---\")","v":0},{"$f":"'D.1 Summary'!H32-'D.1 Summary'!H7","v":92553265.25369978},{"$f":"'D.1 Summary'!I32-'D.1 Summary'!I7","v":10.793426499148779},{"$f":"'D.1 Summary'!J32-'D.1 Summary'!J7","v":19.67680513484504},{"$f":"'D.1 Summary'!K32-'D.1 Summary'!K7","v":0},{"$f":"'D.1 Summary'!L32-'D.1 Summary'!L7","v":0},{"$f":"'D.1 Summary'!M32-'D.1 Summary'!M7","v":0},{"$f":"'D.1 Summary'!N32-'D.1 Summary'!N7","v":-1},{"$f":"'D.1 Summary'!O32-'D.1 Summary'!O7","v":0},{"$f":"'D.1 Summary'!P32-'D.1 Summary'!P7","v":0},{"$f":"'D.1 Summary'!Q32-'D.1 Summary'!Q7","v":-9}]
[null,2016,"Commercial - Partial Claims",4,{"$f":"'D.1 Summary'!E33-'D.1 Summary'!E8","v":-4},{"$f":"'D.1 Summary'!F33-'D.1 Summary'!F8","v":-3.5500000000465661},{"$f":"IFERROR((('D.1 Summary'!G33-'D.1 Summary'!G8)/'D.1 Summary'!G8),\"---\")","v":-1.250955520704402E-16},{"$f":"'D.1 Summary'!H33-'D.1 Summary'!H8","v":437063.55999994278},{"$f":"'D.1 Summary'!I33-'D.1 Summary'!I8","v":0.2543822289851505},{"$f":"'D.1 Summary'!J33-'D.1 Summary'!J8","v":0.28662786364526482},{"$f":"'D.1 Summary'!K33-'D.1 Summary'!K8","v":0},{"$f":"'D.1 Summary'!L33-'D.1 Summary'!L8","v":75},{"$f":"'D.1 Summary'!M33-'D.1 Summary'!M8","v":0},{"$f":"'D.1 Summary'!N33-'D.1 Summary'!N8","v":0},{"$f":"'D.1 Summary'!O33-'D.1 Summary'!O8","v":0},{"$f":"'D.1 Summary'!P33-'D.1 Summary'!P8","v":0},{"$f":"'D.1 Summary'!Q33-'D.1 Summary'!Q8","v":0}]
[null,2016,"Medicare and Medicaid Dual Eligibles ages 65 and over",5,{"$f":"'D.1 Summary'!E34-'D.1 Summary'!E9","v":0},{"$f":"'D.1 Summary'!F34-'D.1 Summary'!F9","v":0},{"$f":"IFERROR((('D.1 Summary'!G34-'D.1 Summary'!G9)/'D.1 Summary'!G9),\"---\")","v":0},{"$f":"'D.1 Summary'!H34-'D.1 Summary'!H9","v":61044343.780000031},{"$f":"'D.1 Summary'!I34-'D.1 Summary'!I9","v":345.05290046520031},{"$f":"'D.1 Summary'!J34-'D.1 Summary'!J9","v":101.04038080972202},{"$f":"'D.1 Summary'!K34-'D.1 Summary'!K9","v":0},{"$f":"'D.1 Summary'!L34-'D.1 Summary'!L9","v":0},{"$f":"'D.1 Summary'!M34-'D.1 Summary'!M9","v":0},{"$f":"'D.1 Summary'!N34-'D.1 Summary'!N9","v":0},{"$f":"'D.1 Summary'!O34-'D.1 Summary'!O9","v":0},{"$f":"'D.1 Summary'!P34-'D.1 Summary'!P9","v":0},{"$f":"'D.1 Summary'!Q34-'D.1 Summary'!Q9","v":0}]
[null,2016,"Medicare and Medicaid Dual Eligibles afes 21-64",6,{"$f":"'D.1 Summary'!E35-'D.1 Summary'!E10","v":0},{"$f":"'D.1 Summary'!F35-'D.1 Summary'!F10","v":0},{"$f":"IFERROR((('D.1 Summary'!G35-'D.1 Summary'!G10)/'D.1 Summary'!G10),\"---\")","v":0},{"$f":"'D.1 Summary'!H35-'D.1 Summary'!H10","v":0},{"$f":"'D.1 Summary'!I35-'D.1 Summary'!I10","v":0},{"$f":"'D.1 Summary'!J35-'D.1 Summary'!J10","v":0},{"$f":"'D.1 Summary'!K35-'D.1 Summary'!K10","v":0},{"$f":"'D.1 Summary'!L35-'D.1 Summary'!L10","v":0},{"$f":"'D.1 Summary'!M35-'D.1 Summary'!M10","v":0},{"$f":"'D.1 Summary'!N35-'D.1 Summary'!N10","v":0},{"$f":"'D.1 Summary'!O35-'D.1 Summary'!O10","v":0},{"$f":"'D.1 Summary'!P35-'D.1 Summary'!P10","v":0},{"$f":"'D.1 Summary'!Q35-'D.1 Summary'!Q10","v":0}]
{"$rows_left_out":52}
{"sheet":"Reference Tables","index":6,"n_rows":41,"n_cols":2,"rows_kept":41,"cut":false,"hidden":false,"merged":[]}
["Total Medical Expenses and Alternative Payment Methods"]
["Reference Tables"]
[]
["Insurance Category Code","Definition"]
[1,"Medicare & Medicare Advantage"]
[2,"Medicaid & Medicaid Managed Care (MCO)"]
[3,"Commercial – Full Claims"]
[4,"Commercial – Partial Claims"]
[5,"Medicare and Medicaid Dual Eligibles, 65 and over (e.g., SCO)"]
[6,"Medicare and Medicaid Dual Eligibles, 21 – 64 (e.g., OneCare)"]
{"$rows_left_out":32}
{"sheet":"Payer Names","index":7,"n_rows":22,"n_cols":3,"rows_kept":22,"cut":false,"hidden":true,"merged":[]}
["Id","Name","ShortName"]
[null,"Select Payer:"]
[290,"Aetna Health Inc.","Aetna"]
[291,"Blue Cross Blue Shield of Massachusetts","BCBSMA"]
[11226,"BMC HealthNet Plan","BMCHP"]
["00001","CHIA","CHIA"]
[11726,"CIGNA - EAST ","Cigna-East"]
[11474,"CIGNA - WEST ","Cigna-West"]
[10728,"Commonwealth Care Alliance","CCA"]
[8026,"Fallon Community Health Plan","Fallon"]
{"$rows_left_out":13}
{"sheet":"System Data","index":8,"n_rows":83,"n_cols":2,"rows_kept":83,"cut":false,"hidden":true,"merged":[]}
[true,"OnSaveFlag"]
[5,"iPayer"]
[{"$f":"INDEX(PayersList,iPayer,1)","v":"00001"},"vPayerOrgID"]
[{"$f":"INDEX(PayersList,iPayer,3)","v":"CHIA"},"vPayerShortName"]
[{"$f":"'A. Front Page'!C12","v":2019},"vFiscalYear"]
[{"$f":"IF(PayerName=\"Select Payer:\", FALSE,TRUE)","v":true},"cfPayerNameSelected"]
[{"$f":"IF(ContactName=\"\", FALSE,TRUE)","v":true},"cfRequiredContactName"]
[{"$f":"IF(ContactEmail=\"\", FALSE, TRUE)","v":true},"cfRequiredContactEmail"]
[{"$f":"IF(AND(cfPayerNameSelected=TRUE,cfRequiredContactName=TRUE,cfRequiredContactEmail=TRUE), TRUE, FALSE)","v":true},"cfRequiredFieldsSelected"]
[{"$f":"INDEX(PayersList,iPayer,1)&\"_\"&INDEX(PayersList,iPayer,3)&\"_\"&FiscalYear&\".xlsm\"","v":"00001_CHIA_2019.xlsm"},"vFileName"]
{"$rows_left_out":73}