{"text_format":"1","workbook":"xlsx","n_sheets":9,"sheets":["Contents","A. Front Page","B. Supp Telehealth Data","C. Expenditures Data","D. Member Months Data","E. Summary","Reference Tables","Payer Names","System Data"],"not_rendered":{"charts":0,"images":0,"macros":1,"external_links":2,"defined_names":6,"comments":0,"pivot_tables":0},"unopened":[],"bounds":{"document_bytes":16777216,"sheet_cells":100000,"rows_first":2000,"rows_last":500,"rows_between":2000,"halvings":0,"cell_chars":16384,"cell_head_chars":4096},"cells_cut":0,"cells_raw":0,"read":"whole","date_system":"1900"}

{"sheet":"Contents","index":0,"n_rows":16,"n_cols":2,"rows_kept":16,"cut":false,"hidden":false,"merged":[]}
["Primary Care and Behavioral Health Expenditures"]
["Data Submission Workbook: 2024 Reporting Cycle"]
[]
["CHIA Submissions Portal"]
["PCBH Data Specifications"]
[]
[]
["This workbook contains the following tabs:"]
[]
["Tab Name","Contents"]
["A. Front Page","Payer Data Entry: Overview of File and Data Verification"]
["B. Supp Telehealth Data","Payer Data Entry: Telehealth Expenditures"]
["C. Expenditures Data","Payer Data Entry: Physician Group PCBH Expenditures Data"]
["D. Member Month Data","Payer Data Entry: Physician Group Member Month Data"]
["E. Summary","Automated Calculation"]
{"$rows_left_out":2}
{"sheet":"A. Front Page","index":1,"n_rows":19,"n_cols":4,"rows_kept":19,"cut":false,"hidden":false,"merged":[[8,1,8,2],[15,1,15,2]]}
["Primary Care and Behavioral Health Expenditures"]
["A. File Overview and Payer Verification "]
[]
[]
[null,"I verify that the information in this workbook is accurate."]
["Contact Name:",null,"[Input Required]"]
["Contact Email:",null,"[Input Required]"]
[]
[null,"Table A.1: File Overview",null,"[Input Required]"]
[null,"Payer Name  *",{"$f":"IF(ISBLANK(iPayer), \"\",INDEX(PayersList,iPayer,2))","v":"Select Payer:"}]
[null,"Payer OrgID",{"$f":"IF(VLOOKUP(C10, 'Payer Names'!B1:D22, 3, FALSE)=0, \"\", VLOOKUP(C10, 'Payer Names'!B1:D22, 3, FALSE))","v":""}]
[null,"Submission Year    *"]
[null,"Reporting Year    *"]
[null,"Claims Paid Through Date   *"]
[]
{"$rows_left_out":5}
{"sheet":"B. Supp Telehealth Data","index":2,"n_rows":3,"n_cols":4,"rows_kept":3,"cut":false,"hidden":false,"merged":[]}
["Primary Care and Behavioral Health Expenditures"]
["B. Telehealth Supplemental Data"]
["Reporting Year","Insurance Category","Service Type","Telehealth Expenditures "]

{"sheet":"C. Expenditures Data","index":3,"n_rows":3,"n_cols":14,"rows_kept":3,"cut":false,"hidden":false,"merged":[]}
["Primary Care and Behavioral Health Expenditures"]
["C. Physician Group Primary Care and Behavioral Health Expenditure Data"]
["Submission Type","Reporting Year","Physician Group OrgID ","Insurance Category Code ","Product Type","PCP Type","Age Group","MassHealth ACO Indicator","GIC Indicator ","Service Type","Spending Service Category","Provider Type","Expenditures: Incurred Expenses","Expenditures: Member Cost Share"]

{"sheet":"D. Member Months Data","index":4,"n_rows":3,"n_cols":12,"rows_kept":3,"cut":false,"hidden":false,"merged":[]}
["Primary Care and Behavioral Health Expenditures"]
["D. Physician Group Membership Data"]
["Submission Type","Reporting Year","Physician Group OrgID ","Insurance Category Code ","Product Type","PCP Type","Age Group","MassHealth ACO Indicator","GIC Indicator ","Member Months","MH Member Months","SUD Member Months"]

{"sheet":"E. Summary","index":5,"n_rows":113,"n_cols":13,"rows_kept":113,"cut":false,"hidden":false,"merged":[[60,0,60,9],[87,0,87,9],[0,0,0,12],[1,0,1,1],[2,0,2,1],[3,0,3,1],[5,0,5,12],[33,0,33,9]]}
["Data Check - Expenditures and Member Month Row Match"]
["Counts the unique records based on columns A:I"]
["Expenditures Data: ",null,{"$f":"ROWS(_xlfn.UNIQUE('C. Expenditures Data'!A4:I10001))-1","v":0}]
["Member Month Data: ",null,{"$f":"ROWS(_xlfn.UNIQUE('D. Member Months Data'!A4:I10001))-1","v":0}]
[]
["Data Summary - Service Type"]
["Year","Insurance Category ","Code","Member Months  ","Total Expenses","Total PMPM ","MH PMPM","SUD PMPM","PC PMPM","Mental Health","Substance Use Disorder","Primary Care","All Other Services"]
[2021,"Medicare & Medicare Advantage ",1,{"$f":"SUMIFS('D. Member Months Data'!J:J,'D. Member Months Data'!B:B,'E. Summary'!A8,'D. Member Months Data'!D:D,C8)","v":0},{"$f":"SUM(J8:M8)","v":0},{"$f":"IFERROR(E8/D8,\"0\")","v":"0"},{"$f":"IFERROR(J8/D8,\"0\")","v":"0"},{"$f":"IFERROR(K8/D8,\"0\")","v":"0"},{"$f":"IFERROR(L8/D8,\"0\")","v":"0"},{"$f":"SUMIFS('C. Expenditures Data'!M:M,'C. Expenditures Data'!B:B,'E. Summary'!A8,'C. Expenditures Data'!D:D,'E. Summary'!C8,'C. Expenditures Data'!J:J,\"1\")+SUMIFS('C. Expenditures Data'!N:N,'C. Expenditures Data'!B:B,'E. Summary'!A8,'C. Expenditures Data'!D:D,'E. Summary'!C8,'C. Expenditures Data'!J:J,\"1\")","v":0},{"$f":"SUMIFS('C. Expenditures Data'!M:M,'C. Expenditures Data'!B:B,'E. Summary'!A8,'C. Expenditures Data'!D:D,'E. Summary'!C8,'C. Expenditures Data'!J:J,\"2\")+SUMIFS('C. Expenditures Data'!N:N,'C. Expenditures Data'!B:B,'E. Summary'!A8,'C. Expenditures Data'!D:D,'E. Summary'!C8,'C. Expenditures Data'!J:J,\"2\")","v":0},{"$f":"SUMIFS('C. Expenditures Data'!M:M,'C. Expenditures Data'!B:B,'E. Summary'!A8,'C. Expenditures Data'!D:D,'E. Summary'!C8,'C. Expenditures Data'!J:J,\"3\")+SUMIFS('C. Expenditures Data'!N:N,'C. Expenditures Data'!B:B,'E. Summary'!A8,'C. Expenditures Data'!D:D,'E. Summary'!C8,'C. Expenditures Data'!J:J,\"3\")","v":0},{"$f":"SUMIFS('C. Expenditures Data'!M:M,'C. Expenditures Data'!B:B,'E. Summary'!A8,'C. Expenditures Data'!D:D,'E. Summary'!C8,'C. Expenditures Data'!J:J,\"4\")+SUMIFS('C. Expenditures Data'!N:N,'C. Expenditures Data'!B:B,'E. Summary'!A8,'C. Expenditures Data'!D:D,'E. Summary'!C8,'C. Expenditures Data'!J:J,\"4\")","v":0}]
[2021,"Medicaid & Medicaid Managed Care (MCO)",2,{"$f":"SUMIFS('D. Member Months Data'!J:J,'D. Member Months Data'!B:B,'E. Summary'!A9,'D. Member Months Data'!D:D,C9)","v":0},0,"0","0",{"$f":"IFERROR(K9/D9,\"0\")","v":"0"},{"$f":"IFERROR(L9/D9,\"0\")","v":"0"},{"$f":"SUMIFS('C. Expenditures Data'!M:M,'C. Expenditures Data'!B:B,'E. Summary'!A9,'C. Expenditures Data'!D:D,'E. Summary'!C9,'C. Expenditures Data'!J:J,\"1\")+SUMIFS('C. Expenditures Data'!N:N,'C. Expenditures Data'!B:B,'E. Summary'!A9,'C. Expenditures Data'!D:D,'E. Summary'!C9,'C. Expenditures Data'!J:J,\"1\")","v":0},{"$f":"SUMIFS('C. Expenditures Data'!M:M,'C. Expenditures Data'!B:B,'E. Summary'!A9,'C. Expenditures Data'!D:D,'E. Summary'!C9,'C. Expenditures Data'!J:J,\"2\")+SUMIFS('C. Expenditures Data'!N:N,'C. Expenditures Data'!B:B,'E. Summary'!A9,'C. Expenditures Data'!D:D,'E. Summary'!C9,'C. Expenditures Data'!J:J,\"2\")","v":0},{"$f":"SUMIFS('C. Expenditures Data'!M:M,'C. Expenditures Data'!B:B,'E. Summary'!A9,'C. Expenditures Data'!D:D,'E. Summary'!C9,'C. Expenditures Data'!J:J,\"3\")+SUMIFS('C. Expenditures Data'!N:N,'C. Expenditures Data'!B:B,'E. Summary'!A9,'C. Expenditures Data'!D:D,'E. Summary'!C9,'C. Expenditures Data'!J:J,\"3\")","v":0},{"$f":"SUMIFS('C. Expenditures Data'!M:M,'C. Expenditures Data'!B:B,'E. Summary'!A9,'C. Expenditures Data'!D:D,'E. Summary'!C9,'C. Expenditures Data'!J:J,\"4\")+SUMIFS('C. Expenditures Data'!N:N,'C. Expenditures Data'!B:B,'E. Summary'!A9,'C. Expenditures Data'!D:D,'E. Summary'!C9,'C. Expenditures Data'!J:J,\"4\")","v":0}]
[2021,"Commercial - Full Claims",3,{"$f":"SUMIFS('D. Member Months Data'!J:J,'D. Member Months Data'!B:B,'E. Summary'!A10,'D. Member Months Data'!D:D,C10)","v":0},0,"0","0","0","0",{"$f":"SUMIFS('C. Expenditures Data'!M:M,'C. Expenditures Data'!B:B,'E. Summary'!A10,'C. Expenditures Data'!D:D,'E. Summary'!C10,'C. Expenditures Data'!J:J,\"1\")+SUMIFS('C. Expenditures Data'!N:N,'C. Expenditures Data'!B:B,'E. Summary'!A10,'C. Expenditures Data'!D:D,'E. Summary'!C10,'C. Expenditures Data'!J:J,\"1\")","v":0},{"$f":"SUMIFS('C. Expenditures Data'!M:M,'C. Expenditures Data'!B:B,'E. Summary'!A10,'C. Expenditures Data'!D:D,'E. Summary'!C10,'C. Expenditures Data'!J:J,\"2\")+SUMIFS('C. Expenditures Data'!N:N,'C. Expenditures Data'!B:B,'E. Summary'!A10,'C. Expenditures Data'!D:D,'E. Summary'!C10,'C. Expenditures Data'!J:J,\"2\")","v":0},{"$f":"SUMIFS('C. Expenditures Data'!M:M,'C. Expenditures Data'!B:B,'E. Summary'!A10,'C. Expenditures Data'!D:D,'E. Summary'!C10,'C. Expenditures Data'!J:J,\"3\")+SUMIFS('C. Expenditures Data'!N:N,'C. Expenditures Data'!B:B,'E. Summary'!A10,'C. Expenditures Data'!D:D,'E. Summary'!C10,'C. Expenditures Data'!J:J,\"3\")","v":0},{"$f":"SUMIFS('C. Expenditures Data'!M:M,'C. Expenditures Data'!B:B,'E. Summary'!A10,'C. Expenditures Data'!D:D,'E. Summary'!C10,'C. Expenditures Data'!J:J,\"4\")+SUMIFS('C. Expenditures Data'!N:N,'C. Expenditures Data'!B:B,'E. Summary'!A10,'C. Expenditures Data'!D:D,'E. Summary'!C10,'C. Expenditures Data'!J:J,\"4\")","v":0}]
[2021,"Commercial - Partial Claims",4,{"$f":"SUMIFS('D. Member Months Data'!J:J,'D. Member Months Data'!B:B,'E. Summary'!A11,'D. Member Months Data'!D:D,C11)","v":0},0,"0","0","0","0",{"$f":"SUMIFS('C. Expenditures Data'!M:M,'C. Expenditures Data'!B:B,'E. Summary'!A11,'C. Expenditures Data'!D:D,'E. Summary'!C11,'C. Expenditures Data'!J:J,\"1\")+SUMIFS('C. Expenditures Data'!N:N,'C. Expenditures Data'!B:B,'E. Summary'!A11,'C. Expenditures Data'!D:D,'E. Summary'!C11,'C. Expenditures Data'!J:J,\"1\")","v":0},{"$f":"SUMIFS('C. Expenditures Data'!M:M,'C. Expenditures Data'!B:B,'E. Summary'!A11,'C. Expenditures Data'!D:D,'E. Summary'!C11,'C. Expenditures Data'!J:J,\"2\")+SUMIFS('C. Expenditures Data'!N:N,'C. Expenditures Data'!B:B,'E. Summary'!A11,'C. Expenditures Data'!D:D,'E. Summary'!C11,'C. Expenditures Data'!J:J,\"2\")","v":0},{"$f":"SUMIFS('C. Expenditures Data'!M:M,'C. Expenditures Data'!B:B,'E. Summary'!A11,'C. Expenditures Data'!D:D,'E. Summary'!C11,'C. Expenditures Data'!J:J,\"3\")+SUMIFS('C. Expenditures Data'!N:N,'C. Expenditures Data'!B:B,'E. Summary'!A11,'C. Expenditures Data'!D:D,'E. Summary'!C11,'C. Expenditures Data'!J:J,\"3\")","v":0},{"$f":"SUMIFS('C. Expenditures Data'!M:M,'C. Expenditures Data'!B:B,'E. Summary'!A11,'C. Expenditures Data'!D:D,'E. Summary'!C11,'C. Expenditures Data'!J:J,\"4\")+SUMIFS('C. Expenditures Data'!N:N,'C. Expenditures Data'!B:B,'E. Summary'!A11,'C. Expenditures Data'!D:D,'E. Summary'!C11,'C. Expenditures Data'!J:J,\"4\")","v":0}]
[2021,"SCO",5,{"$f":"SUMIFS('D. Member Months Data'!J:J,'D. Member Months Data'!B:B,'E. Summary'!A12,'D. Member Months Data'!D:D,C12)","v":0},0,"0","0","0","0",{"$f":"SUMIFS('C. Expenditures Data'!M:M,'C. Expenditures Data'!B:B,'E. Summary'!A12,'C. Expenditures Data'!D:D,'E. Summary'!C12,'C. Expenditures Data'!J:J,\"1\")+SUMIFS('C. Expenditures Data'!N:N,'C. Expenditures Data'!B:B,'E. Summary'!A12,'C. Expenditures Data'!D:D,'E. Summary'!C12,'C. Expenditures Data'!J:J,\"1\")","v":0},{"$f":"SUMIFS('C. Expenditures Data'!M:M,'C. Expenditures Data'!B:B,'E. Summary'!A12,'C. Expenditures Data'!D:D,'E. Summary'!C12,'C. Expenditures Data'!J:J,\"2\")+SUMIFS('C. Expenditures Data'!N:N,'C. Expenditures Data'!B:B,'E. Summary'!A12,'C. Expenditures Data'!D:D,'E. Summary'!C12,'C. Expenditures Data'!J:J,\"2\")","v":0},{"$f":"SUMIFS('C. Expenditures Data'!M:M,'C. Expenditures Data'!B:B,'E. Summary'!A12,'C. Expenditures Data'!D:D,'E. Summary'!C12,'C. Expenditures Data'!J:J,\"3\")+SUMIFS('C. Expenditures Data'!N:N,'C. Expenditures Data'!B:B,'E. Summary'!A12,'C. Expenditures Data'!D:D,'E. Summary'!C12,'C. Expenditures Data'!J:J,\"3\")","v":0},{"$f":"SUMIFS('C. Expenditures Data'!M:M,'C. Expenditures Data'!B:B,'E. Summary'!A12,'C. Expenditures Data'!D:D,'E. Summary'!C12,'C. Expenditures Data'!J:J,\"4\")+SUMIFS('C. Expenditures Data'!N:N,'C. Expenditures Data'!B:B,'E. Summary'!A12,'C. Expenditures Data'!D:D,'E. Summary'!C12,'C. Expenditures Data'!J:J,\"4\")","v":0}]
[2021,"OneCare",6,{"$f":"SUMIFS('D. Member Months Data'!J:J,'D. Member Months Data'!B:B,'E. Summary'!A13,'D. Member Months Data'!D:D,C13)","v":0},0,"0","0","0","0",{"$f":"SUMIFS('C. Expenditures Data'!M:M,'C. Expenditures Data'!B:B,'E. Summary'!A13,'C. Expenditures Data'!D:D,'E. Summary'!C13,'C. Expenditures Data'!J:J,\"1\")+SUMIFS('C. Expenditures Data'!N:N,'C. Expenditures Data'!B:B,'E. Summary'!A13,'C. Expenditures Data'!D:D,'E. Summary'!C13,'C. Expenditures Data'!J:J,\"1\")","v":0},{"$f":"SUMIFS('C. Expenditures Data'!M:M,'C. Expenditures Data'!B:B,'E. Summary'!A13,'C. Expenditures Data'!D:D,'E. Summary'!C13,'C. Expenditures Data'!J:J,\"2\")+SUMIFS('C. Expenditures Data'!N:N,'C. Expenditures Data'!B:B,'E. Summary'!A13,'C. Expenditures Data'!D:D,'E. Summary'!C13,'C. Expenditures Data'!J:J,\"2\")","v":0},{"$f":"SUMIFS('C. Expenditures Data'!M:M,'C. Expenditures Data'!B:B,'E. Summary'!A13,'C. Expenditures Data'!D:D,'E. Summary'!C13,'C. Expenditures Data'!J:J,\"3\")+SUMIFS('C. Expenditures Data'!N:N,'C. Expenditures Data'!B:B,'E. Summary'!A13,'C. Expenditures Data'!D:D,'E. Summary'!C13,'C. Expenditures Data'!J:J,\"3\")","v":0},{"$f":"SUMIFS('C. Expenditures Data'!M:M,'C. Expenditures Data'!B:B,'E. Summary'!A13,'C. Expenditures Data'!D:D,'E. Summary'!C13,'C. Expenditures Data'!J:J,\"4\")+SUMIFS('C. Expenditures Data'!N:N,'C. Expenditures Data'!B:B,'E. Summary'!A13,'C. Expenditures Data'!D:D,'E. Summary'!C13,'C. Expenditures Data'!J:J,\"4\")","v":0}]
[2021,"PACE",7,{"$f":"SUMIFS('D. Member Months Data'!J:J,'D. Member Months Data'!B:B,'E. Summary'!A14,'D. Member Months Data'!D:D,C14)","v":0},0,"0","0","0","0",{"$f":"SUMIFS('C. Expenditures Data'!M:M,'C. Expenditures Data'!B:B,'E. Summary'!A14,'C. Expenditures Data'!D:D,'E. Summary'!C14,'C. Expenditures Data'!J:J,\"1\")+SUMIFS('C. Expenditures Data'!N:N,'C. Expenditures Data'!B:B,'E. Summary'!A14,'C. Expenditures Data'!D:D,'E. Summary'!C14,'C. Expenditures Data'!J:J,\"1\")","v":0},{"$f":"SUMIFS('C. Expenditures Data'!M:M,'C. Expenditures Data'!B:B,'E. Summary'!A14,'C. Expenditures Data'!D:D,'E. Summary'!C14,'C. Expenditures Data'!J:J,\"2\")+SUMIFS('C. Expenditures Data'!N:N,'C. Expenditures Data'!B:B,'E. Summary'!A14,'C. Expenditures Data'!D:D,'E. Summary'!C14,'C. Expenditures Data'!J:J,\"2\")","v":0},{"$f":"SUMIFS('C. Expenditures Data'!M:M,'C. Expenditures Data'!B:B,'E. Summary'!A14,'C. Expenditures Data'!D:D,'E. Summary'!C14,'C. Expenditures Data'!J:J,\"3\")+SUMIFS('C. Expenditures Data'!N:N,'C. Expenditures Data'!B:B,'E. Summary'!A14,'C. Expenditures Data'!D:D,'E. Summary'!C14,'C. Expenditures Data'!J:J,\"3\")","v":0},{"$f":"SUMIFS('C. Expenditures Data'!M:M,'C. Expenditures Data'!B:B,'E. Summary'!A14,'C. Expenditures Data'!D:D,'E. Summary'!C14,'C. Expenditures Data'!J:J,\"4\")+SUMIFS('C. Expenditures Data'!N:N,'C. Expenditures Data'!B:B,'E. Summary'!A14,'C. Expenditures Data'!D:D,'E. Summary'!C14,'C. Expenditures Data'!J:J,\"4\")","v":0}]
[2021,"Other ",8,{"$f":"SUMIFS('D. Member Months Data'!J:J,'D. Member Months Data'!B:B,'E. Summary'!A15,'D. Member Months Data'!D:D,C15)","v":0},0,"0","0","0","0",{"$f":"SUMIFS('C. Expenditures Data'!M:M,'C. Expenditures Data'!B:B,'E. Summary'!A15,'C. Expenditures Data'!D:D,'E. Summary'!C15,'C. Expenditures Data'!J:J,\"1\")+SUMIFS('C. Expenditures Data'!N:N,'C. Expenditures Data'!B:B,'E. Summary'!A15,'C. Expenditures Data'!D:D,'E. Summary'!C15,'C. Expenditures Data'!J:J,\"1\")","v":0},{"$f":"SUMIFS('C. Expenditures Data'!M:M,'C. Expenditures Data'!B:B,'E. Summary'!A15,'C. Expenditures Data'!D:D,'E. Summary'!C15,'C. Expenditures Data'!J:J,\"2\")+SUMIFS('C. Expenditures Data'!N:N,'C. Expenditures Data'!B:B,'E. Summary'!A15,'C. Expenditures Data'!D:D,'E. Summary'!C15,'C. Expenditures Data'!J:J,\"2\")","v":0},{"$f":"SUMIFS('C. Expenditures Data'!M:M,'C. Expenditures Data'!B:B,'E. Summary'!A15,'C. Expenditures Data'!D:D,'E. Summary'!C15,'C. Expenditures Data'!J:J,\"3\")+SUMIFS('C. Expenditures Data'!N:N,'C. Expenditures Data'!B:B,'E. Summary'!A15,'C. Expenditures Data'!D:D,'E. Summary'!C15,'C. Expenditures Data'!J:J,\"3\")","v":0},{"$f":"SUMIFS('C. Expenditures Data'!M:M,'C. Expenditures Data'!B:B,'E. Summary'!A15,'C. Expenditures Data'!D:D,'E. Summary'!C15,'C. Expenditures Data'!J:J,\"4\")+SUMIFS('C. Expenditures Data'!N:N,'C. Expenditures Data'!B:B,'E. Summary'!A15,'C. Expenditures Data'!D:D,'E. Summary'!C15,'C. Expenditures Data'!J:J,\"4\")","v":0}]
{"$rows_left_out":99}
{"sheet":"Reference Tables","index":6,"n_rows":70,"n_cols":2,"rows_kept":70,"cut":false,"hidden":false,"merged":[]}
["Primary Care and Behavioral Health Expenditures"]
["Reference Tables"]
[]
["Insurance Category Code","Definition"]
[1,"Medicare & Medicare Advantage"]
[2,"Medicaid (e.g., ACO, MCO)"]
[3,"Commercial – Full Claims"]
[4,"Commercial – Partial Claims"]
[5,"SCO"]
[6,"OneCare"]
[7,"PACE"]
[8,"Other"]
[]
[]
["Product Type Code","Definition"]
{"$rows_left_out":56}
{"sheet":"Payer Names","index":7,"n_rows":22,"n_cols":4,"rows_kept":22,"cut":false,"hidden":true,"merged":[]}
["Id","Name","ShortName","Id"]
[null,"Select Payer:"]
[290,"Aetna Health Inc.","Aetna",290]
[3735,"AllWays Health Partners","AllWays",3735]
[291,"Blue Cross Blue Shield of Massachusetts","BCBSMA",291]
[11226,"BMC HealthNet Plan","BMCHP",11226]
["00001","CHIA","CHIA","00001"]
[11726,"CIGNA - EAST ","Cigna-East",11726]
[11474,"CIGNA - WEST ","Cigna-West",11474]
[10728,"Commonwealth Care Alliance","CCA",10728]
[8026,"Fallon Community Health Plan","Fallon",8026]
[300,"Harvard Pilgrim Health Care","HPHC",300]
[302,"Health Plans Inc.","HPI",302]
[301,"Health New England","HNE",301]
[11227,"Tufts Public Plans ","THPP",11227]
{"$rows_left_out":8}
{"sheet":"System Data","index":8,"n_rows":27,"n_cols":2,"rows_kept":27,"cut":false,"hidden":true,"merged":[]}
[true,"OnSaveFlag"]
[{"$f":"TODAY()","v":"2024-06-12"},"CurrentDate"]
[1,"iPayer"]
[{"$f":"'A. Front Page'!C12","v":0},"vYear"]
[{"$f":"IF(ISBLANK(iPayer),\"\",INDEX(PayersList,iPayer,3))","v":0},"vPayerShortName"]
[{"$f":"IF(ISBLANK(iPayer),\"\",INDEX(PayersList,iPayer,1))","v":0},"vPayerOrgID"]
[{"$f":"IF(ISBLANK(iPayer),\"\",INDEX(PayersList,iPayer,2))","v":"Select Payer:"},"vPayerName"]
[null,"FilingTypeID"]
[{"$f":"TEXT(A2,\"MMDDYYYY\")","v":"06122024"},"CurrentDateFormat"]
[{"$f":"\"Payer\"&\"_\"&A5&\"_\"&A4&\"_\"&A9&\".xlsm\"","v":"Payer_0_0_06122024.xlsm"},"vFileName"]
[]
[]
[]
[]
[{"$f":"IF(AND(A16=TRUE,A17=TRUE,A18=TRUE,A25=TRUE), TRUE, FALSE)","v":false},"cfAllFrontPageWorkSheet"]
{"$rows_left_out":12}